Reaction Details
TargetCarbonic anhydrase 5B, mitochondrial
LigandBDBM50381319
Substrate/Competitorn/a
Meas. Tech.ChEMBL_814450 (CHEMBL2019846)
Ki 2820±n/a nM
Citation Balboni, GCongiu, COnnis, VMaresca, AScozzafava, AWinum, JYMaietti, ASupuran, CT Flavones and structurally related 4-chromenones inhibit carbonic anhydrases by a different mechanism of action compared to coumarins. Bioorg Med Chem Lett22:3063-6 (2012) 
 
Carbonic anhydrase 5B, mitochondrial
Name:Carbonic anhydrase 5B, mitochondrial
Type:Enzyme
Mol. Mass.:36440.83
Organism:Homo sapiens (Human)
Description:Human (cloned) isozyme
Residue:317
BDBM50381319
NameBDBM50381319
Synonyms:CHEMBL2019143
TypeSmall organic molecule
Emp. Form.C16H12ClNO3
Mol. Mass.301.724
SMILESCOc1ccc(cc1)-c1c(N)oc2ccc(Cl)cc2c1=O