Reaction Details
TargetCarbonic anhydrase 3
LigandBDBM50381325
Substrate/Competitorn/a
Meas. Tech.ChEMBL_814448 (CHEMBL2019844)
Ki 5900±n/a nM
Citation Balboni, GCongiu, COnnis, VMaresca, AScozzafava, AWinum, JYMaietti, ASupuran, CT Flavones and structurally related 4-chromenones inhibit carbonic anhydrases by a different mechanism of action compared to coumarins. Bioorg Med Chem Lett22:3063-6 (2012) 
 
Carbonic anhydrase 3
Name:Carbonic anhydrase 3
Type:Enzyme
Mol. Mass.:29562.11
Organism:Homo sapiens (Human)
Description:Human cloned isozyme.
Residue:260
BDBM50381325
NameBDBM50381325
Synonyms:CHEMBL2019140
TypeSmall organic molecule
Emp. Form.C15H9Cl2NO2
Mol. Mass.306.143
SMILESNc1oc2ccc(Cl)cc2c(=O)c1-c1ccc(Cl)cc1