Reaction Details
TargetCarbonic anhydrase 5B, mitochondrial
LigandBDBM50381325
Substrate/Competitorn/a
Meas. Tech.ChEMBL_814450 (CHEMBL2019846)
Ki 2480±n/a nM
Citation Balboni, GCongiu, COnnis, VMaresca, AScozzafava, AWinum, JYMaietti, ASupuran, CT Flavones and structurally related 4-chromenones inhibit carbonic anhydrases by a different mechanism of action compared to coumarins. Bioorg Med Chem Lett22:3063-6 (2012) 
 
Carbonic anhydrase 5B, mitochondrial
Name:Carbonic anhydrase 5B, mitochondrial
Type:Enzyme
Mol. Mass.:36440.83
Organism:Homo sapiens (Human)
Description:Human (cloned) isozyme
Residue:317
BDBM50381325
NameBDBM50381325
Synonyms:CHEMBL2019140
TypeSmall organic molecule
Emp. Form.C15H9Cl2NO2
Mol. Mass.306.143
SMILESNc1oc2ccc(Cl)cc2c(=O)c1-c1ccc(Cl)cc1