Reaction Details
TargetCarbonic anhydrase 2
LigandBDBM50187668
Substrate/Competitorn/a
Meas. Tech.ChEMBL_814443 (CHEMBL2019839)
Ki 9200±n/a nM
Citation Balboni, GCongiu, COnnis, VMaresca, AScozzafava, AWinum, JYMaietti, ASupuran, CT Flavones and structurally related 4-chromenones inhibit carbonic anhydrases by a different mechanism of action compared to coumarins. Bioorg Med Chem Lett22:3063-6 (2012) 
 
Carbonic anhydrase 2
Name:Carbonic anhydrase 2
Type:Enzyme
Mol. Mass.:29250.71
Organism:Homo sapiens (Human)
Description:P00918
Residue:260
BDBM50187668
NameBDBM50187668
Synonyms:3-Hydroxyflavone 3-hydroxy-2-phenyl-4H-1-benzopyran-4-one 3-hydroxy-2-phenylchromone Flavonol | flavon-3-ol
TypeSmall organic molecule
Emp. Form.C15H10O3
Mol. Mass.238.2381
SMILESOc1c(oc2ccccc2c1=O)-c1ccccc1