Reaction Details
TargetCarbonic anhydrase 12
LigandBDBM50187668
Substrate/Competitorn/a
Meas. Tech.ChEMBL_814447 (CHEMBL2019843)
Ki 6650±n/a nM
Citation Balboni, GCongiu, COnnis, VMaresca, AScozzafava, AWinum, JYMaietti, ASupuran, CT Flavones and structurally related 4-chromenones inhibit carbonic anhydrases by a different mechanism of action compared to coumarins. Bioorg Med Chem Lett22:3063-6 (2012) 
 
Carbonic anhydrase 12
Name:Carbonic anhydrase 12
Type:Enzyme
Mol. Mass.:39456.00
Organism:Homo sapiens (Human)
Description:Catalytic domain of human cloned isozyme was used in the assay
Residue:354
BDBM50187668
NameBDBM50187668
Synonyms:3-Hydroxyflavone 3-hydroxy-2-phenyl-4H-1-benzopyran-4-one 3-hydroxy-2-phenylchromone Flavonol | flavon-3-ol
TypeSmall organic molecule
Emp. Form.C15H10O3
Mol. Mass.238.2381
SMILESOc1c(oc2ccccc2c1=O)-c1ccccc1