Reaction Details
TargetCarbonic anhydrase 1
LigandBDBM50381327
Substrate/Competitorn/a
Meas. Tech.ChEMBL_814440 (CHEMBL2019836)
IC50 8060±n/a nM
Citation Balboni, GCongiu, COnnis, VMaresca, AScozzafava, AWinum, JYMaietti, ASupuran, CT Flavones and structurally related 4-chromenones inhibit carbonic anhydrases by a different mechanism of action compared to coumarins. Bioorg Med Chem Lett22:3063-6 (2012) 
 
Carbonic anhydrase 1
Name:Carbonic anhydrase 1
Type:Enzyme
Mol. Mass.:28873.37
Organism:Homo sapiens (Human)
Description:P00915
Residue:261
BDBM50381327
NameBDBM50381327
Synonyms:CHEMBL2019142
TypeSmall organic molecule
Emp. Form.C16H13NO3
Mol. Mass.267.2793
SMILESCOc1ccc(cc1)-c1c(N)oc2ccccc2c1=O