Reaction Details
TargetCarbonic anhydrase 1
LigandBDBM50381329
Substrate/Competitorn/a
Meas. Tech.ChEMBL_814440 (CHEMBL2019836)
IC50 8370±n/a nM
Citation Balboni, GCongiu, COnnis, VMaresca, AScozzafava, AWinum, JYMaietti, ASupuran, CT Flavones and structurally related 4-chromenones inhibit carbonic anhydrases by a different mechanism of action compared to coumarins. Bioorg Med Chem Lett22:3063-6 (2012) 
 
Carbonic anhydrase 1
Name:Carbonic anhydrase 1
Type:Enzyme
Mol. Mass.:28873.37
Organism:Homo sapiens (Human)
Description:P00915
Residue:261
BDBM50381329
NameBDBM50381329
Synonyms:CHEMBL2019145
TypeSmall organic molecule
Emp. Form.C17H15NO4
Mol. Mass.297.3053
SMILESCOc1ccc(cc1OC)-c1c(N)oc2ccccc2c1=O