Reaction Details
TargetCarbonic anhydrase 1
LigandBDBM50381332
Substrate/Competitorn/a
Meas. Tech.ChEMBL_814440 (CHEMBL2019836)
IC50 95700±n/a nM
Citation Balboni, GCongiu, COnnis, VMaresca, AScozzafava, AWinum, JYMaietti, ASupuran, CT Flavones and structurally related 4-chromenones inhibit carbonic anhydrases by a different mechanism of action compared to coumarins. Bioorg Med Chem Lett22:3063-6 (2012) 
 
Carbonic anhydrase 1
Name:Carbonic anhydrase 1
Type:Enzyme
Mol. Mass.:28873.37
Organism:Homo sapiens (Human)
Description:P00915
Residue:261
BDBM50381332
NameBDBM50381332
Synonyms:CHEMBL2019149
TypeSmall organic molecule
Emp. Form.C16H12ClNO3
Mol. Mass.301.724
SMILESCOc1ccc2c(c1)oc(N)c(-c1ccc(Cl)cc1)c2=O