Reaction Details
TargetCarbonic anhydrase 2
LigandBDBM50381333
Substrate/Competitorn/a
Meas. Tech.ChEMBL_814442 (CHEMBL2019838)
IC50 8740±n/a nM
Citation Balboni, GCongiu, COnnis, VMaresca, AScozzafava, AWinum, JYMaietti, ASupuran, CT Flavones and structurally related 4-chromenones inhibit carbonic anhydrases by a different mechanism of action compared to coumarins. Bioorg Med Chem Lett22:3063-6 (2012) 
 
Carbonic anhydrase 2
Name:Carbonic anhydrase 2
Type:Enzyme
Mol. Mass.:29250.71
Organism:Homo sapiens (Human)
Description:P00918
Residue:260
BDBM50381333
NameBDBM50381333
Synonyms:CHEMBL2019150
TypeSmall organic molecule
Emp. Form.C17H15NO4
Mol. Mass.297.3053
SMILESCOc1ccc(cc1)-c1c(N)oc2cc(OC)ccc2c1=O