Reaction Details
TargetMuscarinic acetylcholine receptor M3
LigandBDBM50381653
Substrate/Competitorn/a
Meas. Tech.ChEMBL_815844 (CHEMBL2026107)
Kd 0.0398±n/a nM
Citation Lainé, DIYan, HXie, HDavis, RSDufour, JWiddowson, KLPalovich, MRWan, ZFoley, JJSchmidt, DBHunsberger, GEBurman, MBacon, AMWebb, EFLuttmann, MASalmon, MSarau, HMUmbrecht, STLandis, PSPeck, BJBusch-Petersen, J Design, synthesis and structure-activity relationship of N-substituted tropane muscarinic acetylcholine receptor antagonists. Bioorg Med Chem Lett22:3366-9 (2012) 
 
Muscarinic acetylcholine receptor M3
Name:Muscarinic acetylcholine receptor M3
Type:Enzyme
Mol. Mass.:66151.03
Organism:Homo sapiens (Human)
Description:P20309
Residue:590
BDBM50381653
NameBDBM50381653
Synonyms:CHEMBL2021997
TypeSmall organic molecule
Emp. Form.C33H39N2O
Mol. Mass.479.675
SMILESC[N@+]1(CCCOCc2ccccc2)C2CCC1C[C@@H](CC(C#N)(c1ccccc1)c1ccccc1)C2