Reaction Details
TargetAurora kinase B
LigandBDBM50381701
Substrate/Competitorn/a
Meas. Tech.ChEMBL_816379 (CHEMBL2024777)
IC50 6±n/a nM
Citation Curtin, MLFrey, RRHeyman, HRSoni, NBMarcotte, PAPease, LJGlaser, KBMagoc, TJTapang, PAlbert, DHOsterling, DJOlson, AMBouska, JJGuan, ZPreusser, LCPolakowski, JSStewart, KDTse, CDavidsen, SKMichaelides, MR Thienopyridine ureas as dual inhibitors of the VEGF and Aurora kinase families. Bioorg Med Chem Lett22:3208-12 (2012) 
 
Aurora kinase B
Name:Aurora kinase B
Type:Protein
Mol. Mass.:39327.72
Organism:Homo sapiens (Human)
Description:Q96GD4
Residue:344
BDBM50381701
NameBDBM50381701
Synonyms:CHEMBL2023226
TypeSmall organic molecule
Emp. Form.C24H20N6OS
Mol. Mass.440.52
SMILESCn1cc(cn1)-c1cnc(N)c2c(csc12)-c1ccc(NC(=O)Nc2ccccc2)cc1