Reaction Details
TargetAurora kinase B
LigandBDBM50201307
Substrate/Competitorn/a
Meas. Tech.ChEMBL_816379 (CHEMBL2024777)
IC50 487±n/a nM
Citation Curtin, MLFrey, RRHeyman, HRSoni, NBMarcotte, PAPease, LJGlaser, KBMagoc, TJTapang, PAlbert, DHOsterling, DJOlson, AMBouska, JJGuan, ZPreusser, LCPolakowski, JSStewart, KDTse, CDavidsen, SKMichaelides, MR Thienopyridine ureas as dual inhibitors of the VEGF and Aurora kinase families. Bioorg Med Chem Lett22:3208-12 (2012) 
 
Aurora kinase B
Name:Aurora kinase B
Type:Protein
Mol. Mass.:39327.72
Organism:Homo sapiens (Human)
Description:Q96GD4
Residue:344
BDBM50201307
NameBDBM50201307
Synonyms:1-(4-(4-aminothieno[3,2-c]pyridin-3-yl)phenyl)-3-m-tolylurea | CHEMBL394619
TypeSmall organic molecule
Emp. Form.C21H18N4OS
Mol. Mass.374.459
SMILESCc1cccc(NC(=O)Nc2ccc(cc2)-c2csc3ccnc(N)c23)c1