Reaction Details
TargetVascular endothelial growth factor receptor 2
LigandBDBM50381692
Substrate/Competitorn/a
Meas. Tech.ChEMBL_816378 (CHEMBL2024776)
IC50 7±n/a nM
Citation Curtin, MLFrey, RRHeyman, HRSoni, NBMarcotte, PAPease, LJGlaser, KBMagoc, TJTapang, PAlbert, DHOsterling, DJOlson, AMBouska, JJGuan, ZPreusser, LCPolakowski, JSStewart, KDTse, CDavidsen, SKMichaelides, MR Thienopyridine ureas as dual inhibitors of the VEGF and Aurora kinase families. Bioorg Med Chem Lett22:3208-12 (2012) 
 
Vascular endothelial growth factor receptor 2
Name:Vascular endothelial growth factor receptor 2
Type:Receptor Tyrosine Kinase
Mol. Mass.:151510.97
Organism:Homo sapiens (Human)
Description:P35968
Residue:1356
BDBM50381692
NameBDBM50381692
Synonyms:CHEMBL1979883
TypeSmall organic molecule
Emp. Form.C26H25N5OS
Mol. Mass.455.575
SMILESCN(C)CC#Cc1cnc(N)c2c(csc12)-c1ccc(NC(=O)Nc2cccc(C)c2)cc1