Reaction Details
TargetCytochrome P450 3A4
LigandBDBM50381703
Substrate/Competitorn/a
Meas. Tech.ChEMBL_816384 (CHEMBL2024782)
IC50 7900±n/a nM
Citation Curtin, MLFrey, RRHeyman, HRSoni, NBMarcotte, PAPease, LJGlaser, KBMagoc, TJTapang, PAlbert, DHOsterling, DJOlson, AMBouska, JJGuan, ZPreusser, LCPolakowski, JSStewart, KDTse, CDavidsen, SKMichaelides, MR Thienopyridine ureas as dual inhibitors of the VEGF and Aurora kinase families. Bioorg Med Chem Lett22:3208-12 (2012) 
 
Cytochrome P450 3A4
Name:Cytochrome P450 3A4
Type:Enzyme
Mol. Mass.:57349.57
Organism:Homo sapiens (Human)
Description:n/a
Residue:503
BDBM50381703
NameBDBM50381703
Synonyms:CHEMBL1970317
TypeSmall organic molecule
Emp. Form.C24H19FN6OS
Mol. Mass.458.511
SMILESCn1cc(cn1)-c1cnc(N)c2c(csc12)-c1ccc(NC(=O)Nc2cccc(F)c2)cc1