Reaction Details
TargetVascular endothelial growth factor receptor 2
LigandBDBM50381691
Substrate/Competitorn/a
Meas. Tech.ChEMBL_816380 (CHEMBL2024778)
IC50 6±n/a nM
Citation Curtin, MLFrey, RRHeyman, HRSoni, NBMarcotte, PAPease, LJGlaser, KBMagoc, TJTapang, PAlbert, DHOsterling, DJOlson, AMBouska, JJGuan, ZPreusser, LCPolakowski, JSStewart, KDTse, CDavidsen, SKMichaelides, MR Thienopyridine ureas as dual inhibitors of the VEGF and Aurora kinase families. Bioorg Med Chem Lett22:3208-12 (2012) 
 
Vascular endothelial growth factor receptor 2
Name:Vascular endothelial growth factor receptor 2
Type:Receptor Tyrosine Kinase
Mol. Mass.:151510.97
Organism:Homo sapiens (Human)
Description:P35968
Residue:1356
BDBM50381691
NameBDBM50381691
Synonyms:CHEMBL2023220
TypeSmall organic molecule
Emp. Form.C25H23N5O2S
Mol. Mass.457.547
SMILESCNC(=O)\C=C\c1cnc(N)c2c(csc12)-c1ccc(NC(=O)Nc2cccc(C)c2)cc1