Reaction Details
TargetGlycogen synthase kinase-3 alpha
LigandBDBM50381716
Substrate/Competitorn/a
Meas. Tech.ChEMBL_816425 (CHEMBL2024912)
IC50>10000±n/a nM
Citation Curtin, MLFrey, RRHeyman, HRSoni, NBMarcotte, PAPease, LJGlaser, KBMagoc, TJTapang, PAlbert, DHOsterling, DJOlson, AMBouska, JJGuan, ZPreusser, LCPolakowski, JSStewart, KDTse, CDavidsen, SKMichaelides, MR Thienopyridine ureas as dual inhibitors of the VEGF and Aurora kinase families. Bioorg Med Chem Lett22:3208-12 (2012) 
 
Glycogen synthase kinase-3 alpha
Name:Glycogen synthase kinase-3 alpha
Type:Enzyme
Mol. Mass.:50991.79
Organism:Homo sapiens (Human)
Description:P49840
Residue:483
BDBM50381716
NameBDBM50381716
Synonyms:ABT-348 US8722890, 1 | US8722890, 2
TypeSmall organic molecule
Emp. Form.C25H21FN6O2S
Mol. Mass.488.537
SMILESNc1ncc(-c2cnn(CCO)c2)c2scc(-c3ccc(NC(=O)Nc4cccc(F)c4)cc3)c12