Reaction Details
TargetPancreatic triacylglycerol lipase
LigandBDBM50381861
Substrate/Competitorn/a
Meas. Tech.ChEMBL_817315 (CHEMBL2025940)
Ki 39000±n/a nM
Citation Park, SYu, J An approach for differentiating isozymes. Construction of libraries containing short aromatic peptides as part of a method to design selective inhibitors against lipases. Bioorg Med Chem Lett22:3147-51 (2012) 
 
Pancreatic triacylglycerol lipase
Name:Pancreatic triacylglycerol lipase
Type:Enzyme
Mol. Mass.:50080.69
Organism:Sus scrofa (Pig)
Description:P00591
Residue:450
BDBM50381861
NameBDBM50381861
Synonyms:CHEMBL2022676
TypeSmall organic molecule
Emp. Form.C35H44N4O5
Mol. Mass.600.7477
SMILESCCCCCCCOc1ccc(NC(=O)CCC(=O)N[C@@H](Cc2ccccc2)C(=O)N[C@@H](Cc2ccccc2)C(N)=O)cc1