Reaction Details
TargetPancreatic triacylglycerol lipase
LigandBDBM50381860
Substrate/Competitorn/a
Meas. Tech.ChEMBL_817316 (CHEMBL2025941)
Ki 170000±n/a nM
Citation Park, SYu, J An approach for differentiating isozymes. Construction of libraries containing short aromatic peptides as part of a method to design selective inhibitors against lipases. Bioorg Med Chem Lett22:3147-51 (2012) 
 
Pancreatic triacylglycerol lipase
Name:Pancreatic triacylglycerol lipase
Type:PROTEIN
Mol. Mass.:51157.75
Organism:Homo sapiens (Human)
Description:ChEMBL_527250
Residue:465
BDBM50381860
NameBDBM50381860
Synonyms:CHEMBL2022680
TypeSmall organic molecule
Emp. Form.C32H38N4O6
Mol. Mass.574.6673
SMILESCCCCOc1ccc(NC(=O)CCC(=O)N[C@@H](Cc2ccc(O)cc2)C(=O)N[C@@H](Cc2ccccc2)C(N)=O)cc1