Reaction Details
TargetPancreatic triacylglycerol lipase
LigandBDBM50381859
Substrate/Competitorn/a
Meas. Tech.ChEMBL_817316 (CHEMBL2025941)
Ki 360000±n/a nM
Citation Park, SYu, J An approach for differentiating isozymes. Construction of libraries containing short aromatic peptides as part of a method to design selective inhibitors against lipases. Bioorg Med Chem Lett22:3147-51 (2012) 
 
Pancreatic triacylglycerol lipase
Name:Pancreatic triacylglycerol lipase
Type:PROTEIN
Mol. Mass.:51157.75
Organism:Homo sapiens (Human)
Description:ChEMBL_527250
Residue:465
BDBM50381859
NameBDBM50381859
Synonyms:CHEMBL2022681
TypeSmall organic molecule
Emp. Form.C38H38N4O5
Mol. Mass.630.7321
SMILESCCCCOc1ccc(NC(=O)CCC(=O)N[C@H](C(=O)N[C@H](C(N)=O)c2ccc3ccccc3c2)c2ccc3ccccc3c2)cc1