Reaction Details
TargetProstaglandin G/H synthase 1
LigandBDBM50382163
Substrate/Competitorn/a
Meas. Tech.ChEMBL_815552 (CHEMBL2025081)
IC50>100000±n/a nM
Citation Chen, MAdeniji, AOTwenter, BMWinkler, JDChristianson, DWPenning, TM Crystal structures of AKR1C3 containing an N-(aryl)amino-benzoate inhibitor and a bifunctional AKR1C3 inhibitor and androgen receptor antagonist. Therapeutic leads for castrate resistant prostate cancer. Bioorg Med Chem Lett22:3492-7 (2012) 
 
Prostaglandin G/H synthase 1
Name:Prostaglandin G/H synthase 1
Type:Enzyme
Mol. Mass.:68692.62
Organism:Homo sapiens (Human)
Description:P23219
Residue:599
BDBM50382163
NameBDBM50382163
Synonyms:CHEMBL2023820
TypeSmall organic molecule
Emp. Form.C17H12N2O4
Mol. Mass.308.2882
SMILESOC(=O)c1cccc(Nc2ccc([N+]([O-])=O)c3ccccc23)c1