Reaction Details
Target1,4-dihydroxy-2-naphthoyl-CoA synthase
LigandBDBM50382347
Substrate/Competitorn/a
Meas. Tech.ChEMBL_817596 (CHEMBL2027819)
IC50 14100±n/a nM
Citation Li, XLiu, NZhang, HKnudson, SELi, HJLai, CTSimmerling, CSlayden, RATonge, PJ CoA Adducts of 4-Oxo-4-Phenylbut-2-enoates: Inhibitors of MenB from the M. tuberculosis Menaquinone Biosynthesis Pathway. ACS Med Chem Lett2:818-823 (2011) 
 
1,4-dihydroxy-2-naphthoyl-CoA synthase
Name:1,4-dihydroxy-2-naphthoyl-CoA synthase
Type:PROTEIN
Mol. Mass.:34688.06
Organism:Mycobacterium tuberculosis
Description:ChEMBL_817596
Residue:314
BDBM50382347
NameBDBM50382347
Synonyms:CHEMBL2024343
TypeSmall organic molecule
Emp. Form.C31H43ClN7O19P3S
Mol. Mass.978.148
SMILESCC(C)(COP(O)(=O)OP(O)(=O)OC[C@H]1O[C@H]([C@H](O)[C@@H]1OP(O)(O)=O)n1cnc2c(N)ncnc12)[C@@H](O)C(=O)NCCC(=O)NCCSC(CC(=O)c1cccc(Cl)c1)C(O)=O