Reaction Details
Target11-beta-hydroxysteroid dehydrogenase 1
LigandBDBM50382388
Substrate/Competitorn/a
Meas. Tech.ChEMBL_814877 (CHEMBL2026619)
Ki 6±n/a nM
Citation Li, AYuan, CCChow, DChen, MEmery, MGHale, CZhang, XSubramanian, RSt Jean, DJKomorowski, RVéniant, MWang, MFotsch, C Synthesis and Evaluation of the Metabolites of AMG 221, a Clinical Candidate for the Treatment of Type 2 Diabetes. ACS Med Chem Lett2:824-827 (2011) 
 
11-beta-hydroxysteroid dehydrogenase 1
Name:11-beta-hydroxysteroid dehydrogenase 1
Type:Enzyme
Mol. Mass.:32409.16
Organism:Homo sapiens (Human)
Description:P28845
Residue:292
BDBM50382388
NameBDBM50382388
Synonyms:CHEMBL2023973
TypeSmall organic molecule
Emp. Form.C14H20N2OS
Mol. Mass.264.386
SMILESCC(=C)[C@]1(C)SC(N[C@H]2C[C@@H]3CC[C@H]2C3)=NC1=O