Reaction Details
TargetAdenosine receptor A1
LigandBDBM50382487
Substrate/Competitorn/a
Meas. Tech.ChEMBL_816162 (CHEMBL2024728)
Ki 275.42±n/a nM
Citation Congreve, MAndrews, SPDoré, ASHollenstein, KHurrell, ELangmead, CJMason, JSNg, IWTehan, BZhukov, AWeir, MMarshall, FH Discovery of 1,2,4-triazine derivatives as adenosine A(2A) antagonists using structure based drug design. J Med Chem55:1898-903 (2012) 
 
Adenosine receptor A1
Name:Adenosine receptor A1
Type:G Protein-Coupled Receptor (GPCR)
Mol. Mass.:36520.92
Organism:Homo sapiens (Human)
Description:P30542
Residue:326
BDBM50382487
NameBDBM50382487
Synonyms:CHEMBL1370747
TypeSmall organic molecule
Emp. Form.C15H12N4
Mol. Mass.248.2826
SMILESNc1nnc(-c2ccccc2)c(n1)-c1ccccc1