Reaction Details
TargetAdenosine receptor A2a
LigandBDBM50382491
Substrate/Competitorn/a
Meas. Tech.ChEMBL_816161 (CHEMBL2024727)
Ki 1.41±n/a nM
Citation Congreve, MAndrews, SPDoré, ASHollenstein, KHurrell, ELangmead, CJMason, JSNg, IWTehan, BZhukov, AWeir, MMarshall, FH Discovery of 1,2,4-triazine derivatives as adenosine A(2A) antagonists using structure based drug design. J Med Chem55:1898-903 (2012) 
 
Adenosine receptor A2a
Name:Adenosine receptor A2a
Type:G Protein-Coupled Receptor (GPCR)
Mol. Mass.:44716.46
Organism:Homo sapiens (Human)
Description:P29274
Residue:412
BDBM50382491
NameBDBM50382491
Synonyms:CHEMBL2024114 | US10988455, Example 1(xlii)
TypeSmall organic molecule
Emp. Form.C15H11ClN4O
Mol. Mass.298.727
SMILESNc1nnc(-c2ccc(O)c(Cl)c2)c(n1)-c1ccccc1