Reaction Details
TargetAdenosine receptor A1
LigandBDBM50382495
Substrate/Competitorn/a
Meas. Tech.ChEMBL_816162 (CHEMBL2024728)
Ki 109.65±n/a nM
Citation Congreve, MAndrews, SPDoré, ASHollenstein, KHurrell, ELangmead, CJMason, JSNg, IWTehan, BZhukov, AWeir, MMarshall, FH Discovery of 1,2,4-triazine derivatives as adenosine A(2A) antagonists using structure based drug design. J Med Chem55:1898-903 (2012) 
 
Adenosine receptor A1
Name:Adenosine receptor A1
Type:G Protein-Coupled Receptor (GPCR)
Mol. Mass.:36520.92
Organism:Homo sapiens (Human)
Description:P30542
Residue:326
BDBM50382495
NameBDBM50382495
Synonyms:CHEMBL2024118 | US10988455, Example 1(clviii)
TypeSmall organic molecule
Emp. Form.C16H14FN5
Mol. Mass.295.3143
SMILESCc1cc(cc(C)n1)-c1nnc(N)nc1-c1cccc(F)c1