Reaction Details
TargetALK tyrosine kinase receptor
LigandBDBM50382660
Substrate/Competitorn/a
Meas. Tech.ChEMBL_816743 (CHEMBL2025772)
IC50 16±n/a nM
Citation Bryan, MCWhittington, DADoherty, EMFalsey, JRCheng, ACEmkey, RBrake, RLLewis, RT Rapid development of piperidine carboxamides as potent and selective anaplastic lymphoma kinase inhibitors. J Med Chem55:1698-705 (2012) 
 
ALK tyrosine kinase receptor
Name:ALK tyrosine kinase receptor
Type:Protein
Mol. Mass.:176453.10
Organism:Homo sapiens (Human)
Description:Q9UM73
Residue:1620
BDBM50382660
NameBDBM50382660
Synonyms:CHEMBL2023556
TypeSmall organic molecule
Emp. Form.C27H30F3N5O5
Mol. Mass.561.5528
SMILESCOc1cc(Nc2nccc(n2)N2CCC[C@@H](C2)C(=O)NCc2cccc(OC(F)(F)F)c2)cc(OC)c1OC