Reaction Details
TargetRho-associated protein kinase 2
LigandBDBM50196697
Substrate/Competitorn/a
Meas. Tech.ChEMBL_817306 (CHEMBL2025931)
IC50 5500±n/a nM
Citation Li, RMartin, MPLiu, YWang, BPatel, RAZhu, JYSun, NPireddu, RLawrence, NJLi, JHaura, EBSung, SSGuida, WCSchonbrunn, ESebti, SM Fragment-based and structure-guided discovery and optimization of Rho kinase inhibitors. J Med Chem55:2474-8 (2012) 
 
Rho-associated protein kinase 2
Name:Rho-associated protein kinase 2
Type:Protein
Mol. Mass.:160885.43
Organism:Homo sapiens (Human)
Description:O75116
Residue:1388
BDBM50196697
NameBDBM50196697
Synonyms:1-benzyl-3-(1H-indazol-5-yl)urea N-benzyl-N0-(1H-5-indazolyl)urea | US9409868, 12
TypeSmall organic molecule
Emp. Form.C15H14N4O
Mol. Mass.266.2979
SMILESO=C(NCc1ccccc1)Nc1ccc2[nH]ncc2c1