Reaction Details
TargetRho-associated protein kinase 1
LigandBDBM50382695
Substrate/Competitorn/a
Meas. Tech.ChEMBL_817305 (CHEMBL2025930)
IC50 9070±n/a nM
Citation Li, RMartin, MPLiu, YWang, BPatel, RAZhu, JYSun, NPireddu, RLawrence, NJLi, JHaura, EBSung, SSGuida, WCSchonbrunn, ESebti, SM Fragment-based and structure-guided discovery and optimization of Rho kinase inhibitors. J Med Chem55:2474-8 (2012) 
 
Rho-associated protein kinase 1
Name:Rho-associated protein kinase 1
Type:Serine/threonine-protein kinase
Mol. Mass.:158156.77
Organism:Homo sapiens (Human)
Description:Q13464
Residue:1354
BDBM50382695
NameBDBM50382695
Synonyms:CHEMBL2023157 | US9409868, 23
TypeSmall organic molecule
Emp. Form.C20H19N3O2
Mol. Mass.333.3838
SMILESOC[C@H](NC(=O)Nc1ccc(cc1)-c1ccncc1)c1ccccc1