Reaction Details
TargetAdenosine receptor A2a
LigandBDBM50382985
Substrate/Competitorn/a
Meas. Tech.ChEMBL_818419 (CHEMBL2034646)
Ki 12.3±n/a nM
Citation Langmead, CJAndrews, SPCongreve, MErrey, JCHurrell, EMarshall, FHMason, JSRichardson, CMRobertson, NZhukov, AWeir, M Identification of novel adenosine A(2A) receptor antagonists by virtual screening. J Med Chem55:1904-9 (2012) 
 
Adenosine receptor A2a
Name:Adenosine receptor A2a
Type:G Protein-Coupled Receptor (GPCR)
Mol. Mass.:44716.46
Organism:Homo sapiens (Human)
Description:P29274
Residue:412
BDBM50382985
NameBDBM50382985
Synonyms:CHEMBL2030689
TypeSmall organic molecule
Emp. Form.C12H14N4O
Mol. Mass.230.2658
SMILESCC(C)c1nc(N)nc(n1)-c1ccccc1O