Reaction Details
TargetAdenosine receptor A2a
LigandBDBM50382986
Substrate/Competitorn/a
Meas. Tech.ChEMBL_818419 (CHEMBL2034646)
Ki 1.58±n/a nM
Citation Langmead, CJAndrews, SPCongreve, MErrey, JCHurrell, EMarshall, FHMason, JSRichardson, CMRobertson, NZhukov, AWeir, M Identification of novel adenosine A(2A) receptor antagonists by virtual screening. J Med Chem55:1904-9 (2012) 
 
Adenosine receptor A2a
Name:Adenosine receptor A2a
Type:G Protein-Coupled Receptor (GPCR)
Mol. Mass.:44716.46
Organism:Homo sapiens (Human)
Description:P29274
Residue:412
BDBM50382986
NameBDBM50382986
Synonyms:CHEMBL2030690
TypeSmall organic molecule
Emp. Form.C21H23N5O2
Mol. Mass.377.4396
SMILESCOC1CCN(CC1)c1cccc(c1)-c1nc(N)nc(n1)-c1ccccc1O