Reaction Details
TargetSmoothened homolog
LigandBDBM50383031
Substrate/Competitorn/a
Meas. Tech.ChEMBL_818642 (CHEMBL2033031)
IC50 15±n/a nM
Citation Solinas, AFaure, HRoudaut, HTraiffort, ESchoenfelder, AMann, AManetti, FTaddei, MRuat, M Acylthiourea, acylurea, and acylguanidine derivatives with potent hedgehog inhibiting activity. J Med Chem55:1559-71 (2012) 
 
Smoothened homolog
Name:Smoothened homolog
Type:Protein
Mol. Mass.:86415.51
Organism:Homo sapiens (Human)
Description:Q99835
Residue:787
BDBM50383031
NameBDBM50383031
Synonyms:CHEMBL2031290
TypeSmall organic molecule
Emp. Form.C31H30N4O5
Mol. Mass.538.5937
SMILESCOc1cc(cc(OC)c1OC)C(=O)NC(N)=Nc1ccc(C)c(NC(=O)c2ccc(cc2)-c2ccccc2)c1