Reaction Details
TargetHistamine H3 receptor
LigandBDBM50158610
Substrate/Competitorn/a
Meas. Tech.ChEMBL_818967 (CHEMBL2034111)
Ki 1.9±n/a nM
Citation Bao, XLu, SLiow, JSZoghbi, SSJenko, KJClark, DTGladding, RLInnis, RBPike, VW Radiosynthesis and evaluation of an (18)F-labeled positron emission tomography (PET) radioligand for brain histamine subtype-3 receptors based on a nonimidazole 2-aminoethylbenzofuran chemotype. J Med Chem55:2406-15 (2012) 
 
Histamine H3 receptor
Name:Histamine H3 receptor
Type:G Protein-Coupled Receptor (GPCR)
Mol. Mass.:48691.47
Organism:Homo sapiens (Human)
Description:Binding assays were using CHO cells stably expressing hH3R receptors.
Residue:445
BDBM50158610
NameBDBM50158610
Synonyms:(4-Fluoro-phenyl)-{2-[2-((R)-2-methyl-pyrrolidin-1-yl)-ethyl]-benzofuran-5-yl}-methanone | CHEMBL555146
TypeSmall organic molecule
Emp. Form.C22H22FNO2
Mol. Mass.351.414
SMILESC[C@@H]1CCCN1CCc1cc2cc(ccc2o1)C(=O)c1ccc(F)cc1