Reaction Details
TargetSodium-dependent dopamine transporter
LigandBDBM50383117
Substrate/Competitorn/a
Meas. Tech.ChEMBL_818802 (CHEMBL2033488)
Ki 137±n/a nM
Citation Bao, XLu, SLiow, JSZoghbi, SSJenko, KJClark, DTGladding, RLInnis, RBPike, VW Radiosynthesis and evaluation of an (18)F-labeled positron emission tomography (PET) radioligand for brain histamine subtype-3 receptors based on a nonimidazole 2-aminoethylbenzofuran chemotype. J Med Chem55:2406-15 (2012) 
 
Sodium-dependent dopamine transporter
Name:Sodium-dependent dopamine transporter
Type:Multi-pass membrane protein
Mol. Mass.:68497.11
Organism:Homo sapiens (Human)
Description:Q01959
Residue:620
BDBM50383117
NameBDBM50383117
Synonyms:CHEMBL2031737
TypeSmall organic molecule
Emp. Form.C22H22N2O4
Mol. Mass.378.4211
SMILESC[C@@H]1CCCN1CCc1cc2cc(ccc2o1)C(=O)c1ccc(cc1)[N+]([O-])=O