Reaction Details
TargetHistamine H3 receptor
LigandBDBM50383442
Substrate/Competitorn/a
Meas. Tech.ChEMBL_818300 (CHEMBL2034348)
Ki 3.4±n/a nM
Citation Xiao, DPalani, ASofolarides, MAslanian, RWest, REWilliams, SMWu, RLHwa, JSondey, CLachowicz, JKorfmacher, WA Fused bicycles as arylketone bioisosteres leading to potent, orally active thiadiazole H3 antagonists. Bioorg Med Chem Lett22:3354-7 (2012) 
 
Histamine H3 receptor
Name:Histamine H3 receptor
Type:G Protein-Coupled Receptor (GPCR)
Mol. Mass.:48691.47
Organism:Homo sapiens (Human)
Description:Binding assays were using CHO cells stably expressing hH3R receptors.
Residue:445
BDBM50383442
NameBDBM50383442
Synonyms:CHEMBL2031602
TypeSmall organic molecule
Emp. Form.C19H25N7S
Mol. Mass.383.514
SMILESCc1nnc2ccc(cn12)-c1nnc(s1)N1CCC(CC1)N1CCCCC1