Reaction Details
TargetHistamine H3 receptor
LigandBDBM50383444
Substrate/Competitorn/a
Meas. Tech.ChEMBL_818300 (CHEMBL2034348)
Ki 3.2±n/a nM
Citation Xiao, DPalani, ASofolarides, MAslanian, RWest, REWilliams, SMWu, RLHwa, JSondey, CLachowicz, JKorfmacher, WA Fused bicycles as arylketone bioisosteres leading to potent, orally active thiadiazole H3 antagonists. Bioorg Med Chem Lett22:3354-7 (2012) 
 
Histamine H3 receptor
Name:Histamine H3 receptor
Type:G Protein-Coupled Receptor (GPCR)
Mol. Mass.:48691.47
Organism:Homo sapiens (Human)
Description:Binding assays were using CHO cells stably expressing hH3R receptors.
Residue:445
BDBM50383444
NameBDBM50383444
Synonyms:CHEMBL2031604
TypeSmall organic molecule
Emp. Form.C19H24N6S
Mol. Mass.368.499
SMILESC1CCN(CC1)C1CCN(CC1)c1nnc(s1)-c1cccc2ccnn12