Reaction Details
TargetHistamine H3 receptor
LigandBDBM50383445
Substrate/Competitorn/a
Meas. Tech.ChEMBL_818300 (CHEMBL2034348)
Ki 4.6±n/a nM
Citation Xiao, DPalani, ASofolarides, MAslanian, RWest, REWilliams, SMWu, RLHwa, JSondey, CLachowicz, JKorfmacher, WA Fused bicycles as arylketone bioisosteres leading to potent, orally active thiadiazole H3 antagonists. Bioorg Med Chem Lett22:3354-7 (2012) 
 
Histamine H3 receptor
Name:Histamine H3 receptor
Type:G Protein-Coupled Receptor (GPCR)
Mol. Mass.:48691.47
Organism:Homo sapiens (Human)
Description:Binding assays were using CHO cells stably expressing hH3R receptors.
Residue:445
BDBM50383445
NameBDBM50383445
Synonyms:CHEMBL2031605
TypeSmall organic molecule
Emp. Form.C21H25N5S
Mol. Mass.379.522
SMILESC1CCN(CC1)C1CCN(CC1)c1nnc(s1)-c1cccc2cccnc12