Reaction Details
TargetHistamine H3 receptor
LigandBDBM50383448
Substrate/Competitorn/a
Meas. Tech.ChEMBL_818300 (CHEMBL2034348)
Ki 4.4±n/a nM
Citation Xiao, DPalani, ASofolarides, MAslanian, RWest, REWilliams, SMWu, RLHwa, JSondey, CLachowicz, JKorfmacher, WA Fused bicycles as arylketone bioisosteres leading to potent, orally active thiadiazole H3 antagonists. Bioorg Med Chem Lett22:3354-7 (2012) 
 
Histamine H3 receptor
Name:Histamine H3 receptor
Type:G Protein-Coupled Receptor (GPCR)
Mol. Mass.:48691.47
Organism:Homo sapiens (Human)
Description:Binding assays were using CHO cells stably expressing hH3R receptors.
Residue:445
BDBM50383448
NameBDBM50383448
Synonyms:CHEMBL2031608
TypeSmall organic molecule
Emp. Form.C21H28N6OS
Mol. Mass.412.552
SMILESO=C(N1CCC1)c1cccc(n1)-c1nnc(s1)N1CCC(CC1)N1CCCCC1