Reaction Details
TargetHistamine H3 receptor
LigandBDBM50383459
Substrate/Competitorn/a
Meas. Tech.ChEMBL_818296 (CHEMBL2034344)
Ki 2.6±n/a nM
Citation Xiao, DPalani, ASofolarides, MAslanian, RWest, REWilliams, SMWu, RLHwa, JSondey, CLachowicz, JKorfmacher, WA Fused bicycles as arylketone bioisosteres leading to potent, orally active thiadiazole H3 antagonists. Bioorg Med Chem Lett22:3354-7 (2012) 
 
Histamine H3 receptor
Name:Histamine H3 receptor
Type:PROTEIN
Mol. Mass.:48560.37
Organism:Mus musculus
Description:ChEMBL_988451
Residue:445
BDBM50383459
NameBDBM50383459
Synonyms:CHEMBL2031619
TypeSmall organic molecule
Emp. Form.C20H24N6OS
Mol. Mass.396.509
SMILESO=c1ccnc2c(cccn12)-c1nnc(s1)N1CCC(CC1)N1CCCCC1