Reaction Details
TargetBifunctional epoxide hydrolase 2
LigandBDBM50383477
Substrate/Competitorn/a
Meas. Tech.ChEMBL_818494 (CHEMBL2032586)
IC50 1.6±n/a nM
Citation Scherman, MSNorth, EJJones, VHess, TNGrzegorzewicz, AEKasagami, TKim, IHMerzlikin, OLenaerts, AJLee, REJackson, MMorisseau, CMcNeil, MR Screening a library of 1600 adamantyl ureas for anti-Mycobacterium tuberculosis activity in vitro and for better physical chemical properties for bioavailability. Bioorg Med Chem20:3255-62 (2012) 
 
Bifunctional epoxide hydrolase 2
Name:Bifunctional epoxide hydrolase 2
Type:Enzyme
Mol. Mass.:62613.07
Organism:Homo sapiens (Human)
Description:P34913
Residue:555
BDBM50383477
NameBDBM50383477
Synonyms:CHEMBL2031924
TypeSmall organic molecule
Emp. Form.C26H36N2O4
Mol. Mass.440.575
SMILESCCOC(=O)c1ccc(O[C@@H]2CC[C@@H](CC2)NC(=O)NC23CC4CC(CC(C4)C2)C3)cc1