Reaction Details
TargetBifunctional epoxide hydrolase 2
LigandBDBM50351248
Substrate/Competitorn/a
Meas. Tech.ChEMBL_818494 (CHEMBL2032586)
IC50 0.4±n/a nM
Citation Scherman, MSNorth, EJJones, VHess, TNGrzegorzewicz, AEKasagami, TKim, IHMerzlikin, OLenaerts, AJLee, REJackson, MMorisseau, CMcNeil, MR Screening a library of 1600 adamantyl ureas for anti-Mycobacterium tuberculosis activity in vitro and for better physical chemical properties for bioavailability. Bioorg Med Chem20:3255-62 (2012) 
 
Bifunctional epoxide hydrolase 2
Name:Bifunctional epoxide hydrolase 2
Type:Enzyme
Mol. Mass.:62613.07
Organism:Homo sapiens (Human)
Description:P34913
Residue:555
BDBM50351248
NameBDBM50351248
Synonyms:CHEMBL1818384
TypeSmall organic molecule
Emp. Form.C17H19F3N2O
Mol. Mass.324.3408
SMILESFc1ccc(NC(=O)NC2C3CC4CC(C3)CC2C4)c(F)c1F