Reaction Details
TargetBifunctional epoxide hydrolase 2
LigandBDBM50383504
Substrate/Competitorn/a
Meas. Tech.ChEMBL_818494 (CHEMBL2032586)
IC50 1.5±n/a nM
Citation Scherman, MSNorth, EJJones, VHess, TNGrzegorzewicz, AEKasagami, TKim, IHMerzlikin, OLenaerts, AJLee, REJackson, MMorisseau, CMcNeil, MR Screening a library of 1600 adamantyl ureas for anti-Mycobacterium tuberculosis activity in vitro and for better physical chemical properties for bioavailability. Bioorg Med Chem20:3255-62 (2012) 
 
Bifunctional epoxide hydrolase 2
Name:Bifunctional epoxide hydrolase 2
Type:Enzyme
Mol. Mass.:62613.07
Organism:Homo sapiens (Human)
Description:P34913
Residue:555
BDBM50383504
NameBDBM50383504
Synonyms:CHEMBL2031802
TypeSmall organic molecule
Emp. Form.C19H22F4N2O2
Mol. Mass.386.3838
SMILESFC(F)C(F)(F)Oc1cccc(NC(=O)NC23CC4CC(CC(C4)C2)C3)c1