Reaction Details
TargetAurora kinase A
LigandBDBM50383822
Substrate/Competitorn/a
Meas. Tech.ChEMBL_819407 (CHEMBL2033074)
IC50 5590±n/a nM
Citation Li, XLu, XXing, MYang, XHZhao, TTGong, HBZhu, HL Synthesis, biological evaluation, and molecular docking studies of N,1,3-triphenyl-1H-pyrazole-4-carboxamide derivatives as anticancer agents. Bioorg Med Chem Lett22:3589-93 (2012) 
 
Aurora kinase A
Name:Aurora kinase A
Type:Serine/threonine-protein kinase
Mol. Mass.:45830.98
Organism:Homo sapiens (Human)
Description:O14965
Residue:403
BDBM50383822
NameBDBM50383822
Synonyms:CHEMBL2030980
TypeSmall organic molecule
Emp. Form.C23H18ClN3O2
Mol. Mass.403.861
SMILESCOc1ccc(cc1)-c1nn(cc1C(=O)Nc1ccc(Cl)cc1)-c1ccccc1