Reaction Details
TargetAurora kinase A
LigandBDBM50383832
Substrate/Competitorn/a
Meas. Tech.ChEMBL_819407 (CHEMBL2033074)
IC50 3040±n/a nM
Citation Li, XLu, XXing, MYang, XHZhao, TTGong, HBZhu, HL Synthesis, biological evaluation, and molecular docking studies of N,1,3-triphenyl-1H-pyrazole-4-carboxamide derivatives as anticancer agents. Bioorg Med Chem Lett22:3589-93 (2012) 
 
Aurora kinase A
Name:Aurora kinase A
Type:Serine/threonine-protein kinase
Mol. Mass.:45830.98
Organism:Homo sapiens (Human)
Description:O14965
Residue:403
BDBM50383832
NameBDBM50383832
Synonyms:CHEMBL2030990
TypeSmall organic molecule
Emp. Form.C22H15ClN4O3
Mol. Mass.418.833
SMILES[O-][N+](=O)c1ccc(cc1)-c1nn(cc1C(=O)Nc1ccc(Cl)cc1)-c1ccccc1