Reaction Details
TargetBeta-secretase 1
LigandBDBM50383838
Substrate/Competitorn/a
Meas. Tech.ChEMBL_819409 (CHEMBL2033076)
IC50 1±n/a nM
Citation Monenschein, HHorne, DBBartberger, MDHitchcock, SANguyen, TTPatel, VFPennington, LDZhong, W Structure guided P1' modifications of HEA derivedß-secretase inhibitors for the treatment of Alzheimer's disease. Bioorg Med Chem Lett22:3607-11 (2012) 
 
Beta-secretase 1
Name:Beta-secretase 1
Type:Protein
Mol. Mass.:55755.10
Organism:Homo sapiens (Human)
Description:P56817
Residue:501
BDBM50383838
NameBDBM50383838
Synonyms:CHEMBL2030996
TypeSmall organic molecule
Emp. Form.C28H38FN3O3
Mol. Mass.483.618
SMILESCC(=O)N[C@@H](Cc1cccc(F)c1)[C@H](O)CN[C@H]1CC2(CCC2)Oc2ncc(CC(C)(C)C)cc12