Reaction Details
TargetCytochrome P450 2C8
LigandBDBM50384469
Substrate/Competitorn/a
Meas. Tech.ChEMBL_821903 (CHEMBL2039549)
IC50 320±n/a nM
Citation Crosignani, SJorand-Lebrun, CCampbell, GPrêtre, AGrippi-Vallotton, TQuattropani, ABouscary-Desforges, GBombrun, AMissotten, MHumbert, YFrémaux, CPâquet, MEl Harkani, KBradshaw, CGCleva, CAbla, NDaff, HSchott, OPittet, PAArrighi, JFGaudet, MJohnson, Z Discovery of a Novel Series of CRTH2 (DP2) Receptor Antagonists Devoid of Carboxylic Acids. ACS Med Chem Lett2:938-942 (2011) 
 
Cytochrome P450 2C8
Name:Cytochrome P450 2C8
Type:Protein
Mol. Mass.:55839.23
Organism:Homo sapiens (Human)
Description:P10632
Residue:490
BDBM50384469
NameBDBM50384469
Synonyms:CHEMBL2036017
TypeSmall organic molecule
Emp. Form.C20H23N5O2
Mol. Mass.365.4289
SMILESCCCCC(=O)N(Cc1ccc(OC)cc1)c1cccc(c1)-c1nnn[nH]1