Reaction Details
TargetProstaglandin D2 receptor 2
LigandBDBM50384484
Substrate/Competitorn/a
Meas. Tech.ChEMBL_821892 (CHEMBL2039538)
Ki 3.6±n/a nM
Citation Crosignani, SJorand-Lebrun, CCampbell, GPrêtre, AGrippi-Vallotton, TQuattropani, ABouscary-Desforges, GBombrun, AMissotten, MHumbert, YFrémaux, CPâquet, MEl Harkani, KBradshaw, CGCleva, CAbla, NDaff, HSchott, OPittet, PAArrighi, JFGaudet, MJohnson, Z Discovery of a Novel Series of CRTH2 (DP2) Receptor Antagonists Devoid of Carboxylic Acids. ACS Med Chem Lett2:938-942 (2011) 
 
Prostaglandin D2 receptor 2
Name:Prostaglandin D2 receptor 2
Type:Enzyme
Mol. Mass.:43295.45
Organism:Homo sapiens (Human)
Description:Q9Y5Y4
Residue:395
BDBM50384484
NameBDBM50384484
Synonyms:CHEMBL2036029
TypeSmall organic molecule
Emp. Form.C20H22ClN5O2
Mol. Mass.399.874
SMILESCCCCC(=O)N(Cc1ccc(OC)cc1)c1cc(Cl)cc(c1)-c1nnn[nH]1