Reaction Details
TargetProstaglandin D2 receptor 2
LigandBDBM50384514
Substrate/Competitorn/a
Meas. Tech.ChEMBL_821892 (CHEMBL2039538)
Ki 17±n/a nM
Citation Crosignani, SJorand-Lebrun, CCampbell, GPrêtre, AGrippi-Vallotton, TQuattropani, ABouscary-Desforges, GBombrun, AMissotten, MHumbert, YFrémaux, CPâquet, MEl Harkani, KBradshaw, CGCleva, CAbla, NDaff, HSchott, OPittet, PAArrighi, JFGaudet, MJohnson, Z Discovery of a Novel Series of CRTH2 (DP2) Receptor Antagonists Devoid of Carboxylic Acids. ACS Med Chem Lett2:938-942 (2011) 
 
Prostaglandin D2 receptor 2
Name:Prostaglandin D2 receptor 2
Type:Enzyme
Mol. Mass.:43295.45
Organism:Homo sapiens (Human)
Description:Q9Y5Y4
Residue:395
BDBM50384514
NameBDBM50384514
Synonyms:CHEMBL2036221
TypeSmall organic molecule
Emp. Form.C19H20FN5O3S
Mol. Mass.417.457
SMILESCC(C)C(=O)N(Cc1ccc(cc1)S(C)(=O)=O)c1cc(F)cc(c1)-c1nnn[nH]1