Reaction Details
TargetProstaglandin D2 receptor 2
LigandBDBM50384475
Substrate/Competitorn/a
Meas. Tech.ChEMBL_821892 (CHEMBL2039538)
Ki 0.9±n/a nM
Citation Crosignani, SJorand-Lebrun, CCampbell, GPrêtre, AGrippi-Vallotton, TQuattropani, ABouscary-Desforges, GBombrun, AMissotten, MHumbert, YFrémaux, CPâquet, MEl Harkani, KBradshaw, CGCleva, CAbla, NDaff, HSchott, OPittet, PAArrighi, JFGaudet, MJohnson, Z Discovery of a Novel Series of CRTH2 (DP2) Receptor Antagonists Devoid of Carboxylic Acids. ACS Med Chem Lett2:938-942 (2011) 
 
Prostaglandin D2 receptor 2
Name:Prostaglandin D2 receptor 2
Type:Enzyme
Mol. Mass.:43295.45
Organism:Homo sapiens (Human)
Description:Q9Y5Y4
Residue:395
BDBM50384475
NameBDBM50384475
Synonyms:CHEMBL2036225
TypeSmall organic molecule
Emp. Form.C23H20FN5O3S
Mol. Mass.465.5
SMILESCS(=O)(=O)c1ccc(CN(C(=O)Cc2ccccc2)c2cc(F)cc(c2)-c2nnn[nH]2)cc1