Reaction Details
TargetProcathepsin L
LigandBDBM19817
Substrate/Competitorn/a
Meas. Tech.ChEMBL_821153 (CHEMBL2039695)
IC50 26000±n/a nM
Citation Stumpfe, DBajorath, J Exploring activity cliffs in medicinal chemistry. J Med Chem55:2932-42 (2012) 
 
Procathepsin L
Name:Procathepsin L
Type:Enzyme
Mol. Mass.:37557.19
Organism:Homo sapiens (Human)
Description:Purchased from Calbiochem (San Diego, CA).
Residue:333
BDBM19817
NameBDBM19817
Synonyms:(1R,2R)-N-(cyanomethyl)-2-[(phenylsulfanyl)methyl]cyclohexane-1-carboxamide racemic mixture
TypeSmall organic molecule
Emp. Form.C16H20N2OS
Mol. Mass.288.408
SMILESO=C(NCC#N)[C@@H]1CCCC[C@H]1CSc1ccccc1