Reaction Details
TargetOxytocin receptor
LigandBDBM50384811
Substrate/Competitorn/a
Meas. Tech.ChEMBL_821157 (CHEMBL2039699)
Ki 0.316±n/a nM
Citation Borthwick, ADLiddle, JDavies, DEExall, AMHamlett, CHickey, DMMason, AMSmith, IENerozzi, FPeace, SPollard, DSollis, SLAllen, MJWoollard, PMPullen, MAWestfall, TDStanislaus, DJ Pyridyl-2,5-diketopiperazines as potent, selective, and orally bioavailable oxytocin antagonists: synthesis, pharmacokinetics, and in vivo potency. J Med Chem55:783-96 (2012) 
 
Oxytocin receptor
Name:Oxytocin receptor
Type:Enzyme Catalytic Domain
Mol. Mass.:42793.26
Organism:Homo sapiens (Human)
Description:Oxytocin OXTR HEK293::B2R9L7
Residue:389
BDBM50384811
NameBDBM50384811
Synonyms:CHEMBL2037490
TypeSmall organic molecule
Emp. Form.C30H39N5O4
Mol. Mass.533.6618
SMILESCC(C)C[C@H]1N([C@@H](C(=O)N2CCOCC2)c2ccc(nc2)N(C)C)C(=O)[C@H](NC1=O)C1Cc2ccccc2C1